Test Discovery fails with E ModuleNotFoundError: No module named ...
VSCode running Python Azure Function locally fails with ...
1.0.16 fails to import with `ModuleNotFoundError: No module named ...
python - PyDev attach to process fails with `ModuleNotFoundError: No ...
python - ModuleNotFoundError: No module named X when using foreach ...
Importing local module into Python function fails · Issue #374 · Azure ...
Result: Failure Exception: ModuleNotFoundError: No module named ...
[Solved] ModuleNotFounderror: No Module named _ctypes in Python
ModuleNotFoundError: No module named ‘paramiko‘ 和ModuleNotFoundError ...
ModuleNotFoundError: No module named ‘pandas’ in Python – Its Linux FOSS
ModuleNotFoundError: No module named ‘torch‘解决方案python安装torch(python3.6 ...
ModuleNotFoundError: No module named ‘setuptools_rust ...
ModuleNotFoundError: No module named 'azureml'. · Issue #817 · Azure ...
ModuleNotFoundError: No module named 'http.client'; 'http' is not a ...
ModuleNotFoundError: No module named 'sklearn' in Python | bobbyhadz
ModuleNotFoundError: No module named ‘sklearn’ in Python – Its Linux FOSS
ModuleNotFoundError: No module named ‘sklearn.datasets.samples ...
Modulenotfounderror: Selenium - No Module Named 'Selenium' Exception ...
Solved: ModuleNotFoundError: No module named 'sklearn' in Python3 ...
ModuleNotFoundError: No module named 'PyQt4',Spyder 导入 matplotlib 错误 ...
Python function failed in 1s (no logs, no response, no errors ...
ModuleNotFoundError: No module named ‘docx‘_modulenotfounderror: no ...
ComfyUI Import Failed for custom nodes - ModuleNotFoundError: No module ...
ModuleNotFoundError: No module named ‘matplotlib‘ 解决办法 - BugMiaowu2021 ...
【Azure 应用服务】[App Service For Linux] Python ModuleNotFoundError: No ...
python报错 ModuleNotFoundError: No module named ‘StringIO‘_pip stringio ...
ModuleNotFoundError: No module named ‘PIL’ in Python – Its Linux FOSS
Exception: ModuleNotFoundError: No module named 'azure.durable ...
ModuleNotFoundError: No module named ‘termios‘_no module named 'termios ...
cefpython3在用pyinstaller打包报错 ModuleNotFoundError: No module named 'json ...
python - How to solve No module named 'selenium' in VS code? - Stack ...
AWS p2 instance setup - Error Lesson 1 - ModuleNotFoundError: No module ...
Chapter 2: ModuleNotFoundError: No module named 'future_encoders ...
Azure Python Function App deployment fails on adding tensorflow to ...
Failed To Build Psutil _ ModuleNotFoundError: No module named ‘psutil ...
ModuleNotFoundError: No module named 'sklearn.cross_validation' · Issue ...
python - 解决 ModuleNotFoundError: No module named 'pip' - 程序员大本营
Bug: Pyinstaller4 under Python38 - ModuleNotFoundError: No module named ...
【已解决】ModuleNotFoundError: No module named ‘IPython‘_modulenotfounderror ...
🐍 How to Fix ModuleNotFoundError (No Module Named) Error in Python ...
Fix ModuleNotFoundError: No Module Named 'tensorflow.python.keras'
[SOLVED] Python No Module Named Pil - Python Pool
vscode调试robotframe work导入module失败ModuleNotFoundError: No module named ...
Spyder启动报错:ModuleNotFoundError: No module named ‘PyQt5.QtWebKitWidgets ...
python - Converting SVG to PDF using CairoSVG fails ...
【python报错】ModuleNotFoundError: No module named 'ortools.constraint ...
Trigger the HttpTrigger function using Timer trigger using azure ...
Python安装Factory/faker失败的解决办法:ModuleNotFoundError: No module named ...
Python3报错Crypto失败(from Crypto.Cipher import AES ModuleNotFoundError: No ...
ModuleNotFoundError: No module named 'paddleclas' - 知乎
Calling a HTTP Trigger Logic App (Post Call) with an Azure Function ...
ModuleNotFoundError: No module named 'jsonpath' - 上山打老虎下山采蘑菇 - 博客园
Getting error No HTTP triggers found during Azure Function deploying ...
Azure Function App (python HttpTrigger) failed to publish with ...
sublime下python3引用文件报错ModuleNotFoundError: No module named 'settings'问题 ...
python - Azure Function App HTTP Trigger Functions don't show when ...
Python安装Pytorch(解决ModuleNotFoundError: No module named ‘torch‘)-腾讯云开发者 ...
Jupyter Notebook中出现“ModuleNotFoundError: No module named 'imblearn'”错误 ...
安装Tensorflow及安装过程中的错误——ModuleNotFoundError: No module named 'tensorflow ...
yolov8 ModuleNotFoundError: No module named ‘ultralytics.nn‘
Deploy function from VS code to function app in Azure: No HTTP triggers ...
python - Azure Functions App works with direct input url which under ...
【Azure 应用服务】Azure Function App Linux环境下的Python Function,安装 psycopg2 模块 ...
Python|报错提示ModuleNotFoundError: No module named 'xlrd' - 知乎
fix no http triggers found azure functions python fastapi - YouTube
Python解决ModuleNotFoundError: No module named 'pymysql'的问题 - EdisonYao - 博客园
## Incorrect HttpTrigger URL · Issue #992 · Azure/azure-functions ...
Modulenotfounderror no module named scipy - ablebap
【已解决】PyCharm中调试出错:ModuleNotFoundError: No module named – 在路上
17、ModuleNotFoundError: No module named 'pywin32_bootstrap' - 知乎
如何解决:ModuleNotFoundError: No module named 'scipy' - 知乎
python - Azure http trigger functions throwing an error over imported ...
GitHub - mjrulesamrat/azure-function-HTTPTrigger: Azure Functions with ...
PyCharm使用lxml库报错(ModuleNotFoundError: No module named 'lxml')解决办法-CSDN博客
Fix : No HTTP triggers found (Azure Functions) - Python FastApi - YouTube
Azure http trigger is not allowing to create a folder in python using ...
image processing - Using Python node in LabView returns Error 1667 (No ...
Azure Function fails suddenly - Microsoft Q&A
Azure timer trigger function using Python - Stack Overflow
解决Python模块报错:ModuleNotFoundError: No module name 'StringIO' - 菖蒲依依 - 博客园
ImportError: No module named Bio - 小鲨鱼2018 - 博客园
机器学习:ModuleNotFoundError: No module named 'sklearn'? - 知乎
PYTHON: How can I troubleshoot Python Could not find platform ...
【问题解决】ModuleNotFoundError: No module named 'skimage' - wydxry - 博客园
Creating Durable Functions HTTP Start and debugging locally resulted in ...
Python Django开发常见报错排查与解决方法-开发者社区-阿里云
Import Requests Modulenotfounderror Module Named – GRFZ
Python ImportError | Understanding the Functions of ImportError in Python
pyCharm运行import torch报错:Traceback (most recent call last): File “<stdin ...
[python]在运行时在 Azure 函数中安装 python 模块 - 编程宝典
ERROR: No matching distribution found for matplotlib.pyplt-CSDN博客
How to Retry Failed HTTP Requests using Python Request
ncclUnhandledCudaError: Call to CUDA function failed.-CSDN博客
python词云wordcloud运行时出现No module named 'matplotlib' - 知乎
OOPS Concepts in Python and Exception Handling | PPSX
Python3爬Traceback (most recent call last): File "/Library/Frameworks ...
Function build failed (python) - Threads - Appwrite
numba版本问题以及无法uninstall解决-CSDN博客
报错解决方法_error: (-215:assertion failed) src.cols > 0 && src-CSDN博客
解决win10安装cupy包报错 - jym蒟蒻 - 博客园
【初心者向け】Azure FunctionsでPythonを実行する(HTTP Trigger) – TechHarmony