How to fix building errors such as MSB8066 and others? · Issue #4695 ...
Open3D Build Error MSB8066 and C4819 from Visual Studio · Issue #3975 ...
Error MSB8066 when trying to build compiler · Issue #5420 · microsoft ...
how to fix "there were build errors, would you like to continue and run ...
How to FIX PC Building Simulator All Errors - YouTube
Typo in link redirects to wrong site · Issue #4695 · dotnet ...
How to fix ‘No such module Flutter’ Error in Xcode | by Gautier ...
How to Fix the No such file or directory Error While Installing Pip on ...
build with VS2019 + windows 10, ERROR MSB8066 · Issue #42002 ...
Issue while building windows application (error MSB8066) · Issue ...
Flutter Windows: cannot build Windows App error MSB8066 · Issue #84115 ...
How to Fix Path of Building Lua Error Effectively
Error MSB8029 and MSB3073 when doing `flet build windows` · Issue #3107 ...
Build Failed — How to Fix JavaScript Build Errors
How to Fix Path of Building Lua Error Quickly
MSB4062 error on Win7 buildserver using WiX3.5 and .NET4 · Issue #2682 ...
How to Fix Build Failed Errors in Your VueJS Project - YouTube
Terminal failed to build with error MSB8020 on MSVC · Issue #14096 ...
Top 10 Flutter Build Errors Beginners See (and How to Fix Them)
How to Fix Firebase Studio Build Error | Firebase Environment Build ...
MSB8020 error when building the repo · Issue #56171 · dotnet/aspnetcore ...
The Top 10 Computer Build Errors - How to troubleshoot a computer in 10 ...
How to Fix 'Build Optimization' Errors in Next.js
fix build errors from MP re-org by Hwurzburg · Pull Request #4590 ...
How To Fix Common Errors Quickly & Easily
How to Fix Capacitor Plugin Build Errors with AGP 9 - Capawesome
error MSB8011: Failed to register output · Issue #50 · MapWindow ...
Docker Build Failed — How to Fix Common Docker Build Errors
How to Repair Microsoft Office Installation Errors in Windows - Guiding ...
Getting errors 8892 and 7255 while trying to connect to MSS database ...
How To Fix Error Loadlibrary Failed with Error 87 The Parameter is ...
Warning MSB3884 when building from command line · Issue #361 · dotnet ...
Flutter Run Build Window failed Error MSB8066 · community · Discussion ...
MSB8066 error while building 3DSlicer latest version - Support - 3D ...
MSB8066 Building Error while building slicer latest version in Win11 ...
MSB8066 Error · Issue #17 · nvpro-samples/optix_advanced_samples · GitHub
Error MSB8066 · Issue #6 · pavel-pimenov/flylinkdc-r6xx · GitHub
MSBuild error MSB4062 not fails build · Issue #1606 · cake-build/cake ...
Build failing with error MSB4062 (gets fixed with cache clean) · Issue ...
BUILDING REPAIR COMMON ERRORS (GROUNDS, MISS BUILDING, INCONSISTENT ...
I get a error MSB4062 with Build Wpf Project · Issue #5090 · dotnet ...
How to Fix Gradle Build Failed Error in Flutter Complete Guide
MSBUILD : error MSB1009: 项目文件不存在。 开关:install.vcxproj · Issue #4336 ...
Easy Fix Building Doesn't Match LC Online Training Common Error for ...
Ionic Error: Module Build Failed - Fix ENOENT No Such File or Directory ...
Fix Lovable Build Failed Errors (2026 Troubleshooting Guide) - AppStuck ...
MSBUILD : error MSB1009: Project file does not exist. · Issue #2063 ...
Cant start new build, after clicking NEW getting error · Issue #4605 ...
How fix MSBUILD : error MSB1003: Specify a project or solution file ...
[ARM64/Linux] error MSB6006: "csc.dll" exited with code 139. · Issue ...
error MSB6006: "csc.dll" exited with code 139 · Issue #57558 · dotnet ...
MSBUILD : error MSB1009: 项目文件不存在。 · Issue #53 · RayWangQvQ ...
How To Fix PlayStation 4 Error CE-34878-0 (Updated) 2026
Problem in FS after updating the core · Issue #6097 · esp8266/Arduino ...
错误 MSB8066 C:\Program Files (x86)\Microsoft Visual Studio\2019 ...
MSBuild error: MSB8066 custom build for ‘‘ exited with code 3_error ...
Td failed to build with "error MSB8066: Custom build for exited with ...
Windows: MSB4016 error on build · Issue #5 · xoofx/dotnet-releaser · GitHub
ext_tbb build MSB8066, C2001 error · Issue #3995 · isl-org/Open3D · GitHub
Fix Path of Building Lua Error: Troubleshooting Guide
Errors when compiling OpenCV with GPU Support in Visual Studio C++ ...
build error, MSB806 · Issue #636 · KhronosGroup/KTX-Software · GitHub
MSB8066 “E:\opencv-4.8.0\build\x64\CMakeFiles ...
error MSB4062 · Issue #265 · loresoft/msbuildtasks · GitHub
Docker Compose Build Up: A Practical Guide to docker compose build up ...
Solved! Path of Building Lua Error: Quick Fix Guide
在vs编译qt项目遇到 错误 MSB8066 “debug\moc_predefs.h.cbt”的自定义生成已退出,代码为 2。 Camera ...
Fix Heroku Build Errors A Complete Step-by-Step Guide | MoldStud
Build failed: MSB3026 · Issue #6567 · files-community/Files · GitHub
Trouble issue - UnrealEngine 5.5 build Failed D8037, MSB3073 ...
Fix all unity build errors, crashes, bugs or add new feature by ...
Fix defaultuser0 Issue in 5 Steps
Build Error MSB8013: This project doesn't contain the Configuration and ...
Fix unity build errors, crashes, bugs and ads by Haroonbutt1212 | Fiverr
MSBuild Error · Issue #7056 · BVLC/caffe · GitHub
Windows visual studio 2019 compile Video Codec SDK 12.1 faild, error ...
hello!now i have complished all of these steps,but the last step-"cmake ...
Flutter windows build process failed: \Microsoft.CppCommon.targets(241 ...
编译过程中报错 error MSB8066: “..\..\include\interfaces\ThriftController ...
Fix: Gradle Build Failed – Could Not Resolve Dependencies or ...
VS2019 错误 MSB8066 自定义生成已退出,代码为 3-CSDN博客
MSB8066 “plugin_form.ui;QtPluginRollup.h”的自定义生成已退出,代码为 3。 - 知乎
vs2019+QT 出现错误MSB8066 “QtGuiClass.h;SocketServer.h;DbPage.h ...
[Bug]: "MSBUILD : error MSB4166: Child node "5" exited prematurely ...
Build fails with MSBUILD error MSB1009: Project file does not exist ...
Android Studio Error: "FAILURE: Build failed with an exception" - XOps ...
error MSB8020: The build tools for v143 (Platform Toolset = 'v143 ...
Build failed, MSB6006: csc.dll exited with code 139 on Ubuntu ARM64 ...
wix - HeatDirectory failure on TFS with MSBUILD error MSB4166: Child ...
[Unhandled Exception]: "error MSB4166: Child node "2" exited ...
Solved "MSBuild : Error MSB1008: Only one project can be specified ...
Fix Maven Build failure error - YouTube
multithreading - error MSB4166: Child node exited prematurely. Shutting ...
Flutter + Codebuddy的坑_codebuddy cannot connect to api-CSDN博客
get error MSB8020 when build in vs2017 community in some projects in ...
Fix Lightningcss Build Error on AWS EC2 for Next js Production
MSBUILD Error MSB4801 even when using RoslynCodeTaskFactory on Azure ...
Fix Next.js Build Out of Memory Error | Heap Limit Solutions
c++ - Visual Studio MSBuild Error MSB8066: Custom build - Stack Overflow
Flutter 运行报错 ...error MSB8066...-CSDN博客
Error MSB8066:Moc‘ing Config.h(系统找不到指定的路径)_error msb8066:-CSDN博客
Slicer Build error:MSB8066 in Win10 - Development - 3D Slicer Community
Windows 빌드 오류 MSB8066, C1083 - Flutter
Can Windows Update Cause Problems? [List of Problems & Errors]
Windows GRPC源码编译C++库——详细步骤_grpc源码下载-CSDN博客
MSB Installation failure trouble shooting steps
git - Msbuild error in command line,Error MSB4067 - Stack Overflow
Build error: not our ref - Support - Netlify Support Forums
QCAD v3.28.1.3源码编译,使用VS2019+Qt5.15.2环境 - 技术栈