algorithm - Vector subscript out of range error in c++ and opencv ...
Vector Subscript out of range error in Java - Android/Java - OpenCV
opencv - Vector subscript out of range error - C++ Vectors & OpenCV4 ...
c++ - vector subscript out of range error using three vectors, how do I ...
c++ - Vector subscript out of range in SFML game, but no vectors were ...
Vector subscript out of range - C++ Vectors/OpenCV - Stack Overflow
c++ - "vector subscript out of range" error is wrong (VS2013) - Stack ...
tensorflow - Python: How to solve list index out of range error for ...
Subscript out of range.docx - Subscript out of range Error 9 06/08/2017 ...
boost - SCIP Optimization Suite Installation: Vector Subscript Out of ...
PDF417 can cause a vector subscript out of range error · Issue #517 ...
stdvector - C++: Dealing with 'Vector subscript out of range' - Stack ...
c++ - “vector subscript out of range” error in loop
point cloud library - Debug assertion failed, vector subscript out of ...
#define 변수와 vector subscript out of ... - 인프런 | 커뮤니티 질문&답변
[C++] Vector subscript out of range - The freeCodeCamp Forum
c++ - Vector subscript out of range, PCL octree - Stack Overflow
opencv - "Tuple index out of range" error when trying to create an exe ...
CCDComander Error: 9 Subscript out of range - Experienced Deep Sky ...
vector subscript out of range · Issue #3 · JustasBart/yolov8_CPP ...
dynafu_tsdf.cpp meshPoints[] vector subscript out of range · Issue ...
FaceRecognizerSF.feature C++ throws vector subscript out of range ...
TrackerGOTURN sample code crash! Vector subscript out of range ...
Out of range error in function TSVGIconImage.SVGIconItem · Issue #198 ...
Debug Assertion Failure 'Expression: vector subscript out of range ...
c++ - How to solve 'vector subscript out of range' error? - Stack Overflow
Vector subscript out of range when running the basic example · Issue ...
Camera Index out of range issue - Have tried everything!!! · Issue ...
OpenCV VideoCapture - Index out of range - kworker process - C++ - OpenCV
inferCNV : Error in obs_dendrogram[[1]] : subscript out of bounds ...
Expression: vector subscript out of range · Issue #1 · ghord/inkmath ...
libtorch and MSVC: vector subscript out of range while registe module ...
kinfu vector subscript out of range · Issue #9432 · IntelRealSense ...
Error: Vector subscript out of range · Issue #231 · mapbox/mapnik ...
VBA Subscript Out of Range - Why it Occurs, How to Fix?
tensorflow 2 TextVectorization process tensor and dataset error - Stack ...
Vector subscript out of range. On a boosting procedure. · Issue #8384 ...
Vector Subscript out of range 4.7.x · Issue #23364 · opencv/opencv · GitHub
Java cv::dnn::TextDetectionModel_DB error Expression: vector subscript ...
OpponentColorDescriptorExtractor::computeImpl vector subscript out of ...
Object Detection: Multi-GPU Out of Range error for model faster_rcnn ...
使用“调用堆栈”解决“Expression:vector subscript out of range”_expression: vector ...
[Visual Studio] Vector subscript out of range 에러가 뜨는 경우
opencv - Exception in thread "main" java.lang.UnsatisfiedLinkError: no ...
Java OpenCV Not Detecting Contours Properly - Stack Overflow
Vector Subscript Out Of Range 原因 – GPMG
java - Why is my Vector size 0? - Stack Overflow
Runtime Error Out Of Stack Range – AGDOB
C++ Vector Subscript Out Of Range
Error in *** : subscript out of bounds-CSDN博客
Run Time Error 9 (Subscript Out of Range) - How to Fix!
Expression Vector Subscript Out Of Range – XKGJCK
VBA Subscript Out of Range (Run-Time Error '9') | Why this Error Occur?
Resolving the Out of Range Error When Processing Large CSV Files with ...
vector subscript out of range弹窗错误-CSDN博客
Getting error related to opencv for segmentation model with out torch ...
input image batch into tensorflow model error · Issue #13540 · opencv ...
新手程序:vector subscript out of range 求大神解决!_-CSDN问答
c++ 中vector subscript out of range 怎么解决?_编程语言-CSDN问答
OpenCV Error: Incorrect size of input array () in cvGetSubRect ...
c++ - debug assertion failed vc\include\vector vector iterator + offset ...
c++ - Using Opencv and Hough Transform circle to detect circles ...
list index out of range:在TensorFlow设置GPU运行时报错_wrong in load gpu info ...
Subscript Out Of Range When Importing Data – RNZZUH
二维vector,clear()操作请慎重,当心遇到vector subscript out of range问题_vector ...
解决Vector subscript out of range下标超出范围_vector超出范围怎么解决-CSDN博客
Vector使用报错:Expression:vector subscript out of range-CSDN博客
Seg fault when using opencv 3 with tensorflow · Issue #8155 · opencv ...
Python错误集锦:OpenCV HoughCircles找圆时提示One of the arguments’ values is out ...
error: subscript is a logical vector with out-of-bounds TRUE values ...
Segmentation fault with Java and OpenCV 3.3.1 · Issue #10080 · opencv ...
OpenCV getting error "Cant parse contours. Input argument doesnt ...
OpenCV cannot import frozen TensorFlow graph: Input layer not found ...
c++ - std::vector size not being set and data isn't assigned properly ...
为什么这里会报错vector subscript out of range?_编程语言-CSDN问答
OpenCV Error: The function/feature is not implemented in (Unknown ...
minEnclosingTriangle() raises an error when input is vector · Issue ...
Tensorflow Dataset API, OutOfRangeError: End of sequence · Issue #24399 ...
Loading Tensorflow model. Error: Unspecified error (More than one input ...
Exception in thread “main“ java.lang.UnsatisfiedLinkError: no opencv ...
4 Basic Solutions of 'Subscript out of range' Visual Basic Error
opencv imported after tensorflow can't read jpeg · Issue #1924 ...
`invalid vector subscript` on final operation of a state handler `(code ...
YOLO 실행시 발생, IndexError: list index out of range
Can't parse simple TensorFlow model. Error:Error parsing text-format ...
PPT - CIS162AD - C# PowerPoint Presentation, free download - ID:5635861
백준 2630 색종이 만들기 - 파이썬, C++
Convolutional Neural Networks for Image Classification in TensorFlow.js ...
javaCV 1.5.10 + openCV 4.9.0-1.5.10 error: java.lang ...
Mismatch in opencv-python and opencv-python-headless versions · Issue ...
tensorflow throws "INFO:tensorflow:Caught OutOfRangeError. Stopping ...
OpenCV(4.9.0-dev) Error: Unspecified error (> Node [LayerNormalization ...
java: opencv 4.5.3 ,cv::Exception: OpenCV(4.5.3) C:\build\master ...
IndexError List Assignment and How to Fix It - Python Pro Hub
OpenCV(4.5.2) :-1: error: (-5:Bad argument) in function 'rectangle ...
R 'Subscript Out of Bounds' Error: Fixes [Solved]
java Vector 在多线程使用中需要注意的问题_java vector.remove 多线程-CSDN博客
java.lang.RuntimeException: Failed to find input Node 'image_tensor ...
cv2.error: OpenCV(4.8.0) /io/opencv/modules/core/src/batch_distance.cpp ...
TypeError: 'SparseTensor' object is not subscriptable · mrdbourke ...
java.lang.NoSuchMethodError: org.tensorflow.framework.MetaGraphDef ...
There is a problem with OpenCV's environment and ocr_v2's environment ...
[Solved] : Excel File Error Data may have been Lost
使用Windbg动态调试目标程序去分析异常的两实战案例分享
언리얼 엔진 본캠프 2주차-2 C++ (vector, 배열)
java调用opencv提取特征点报错 · Issue #13408 · opencv/opencv · GitHub
欢迎您
ch06.ppt