Showing 120 of 120on this page. Filters & sort apply to loaded results; URL updates for sharing.120 of 120 on this page
3 Steps to Solve Java Error Code 1603 | PDF
Java Error Code 1603? Here's How to Fix for Windows
Fix Java Error Code 1603: Step-by-Step Guide | Fdaytalk GG
[Solved] How to Fix Java Install Did Not Complete Error Code 1603 In ...
Java install did not complete. Error Code: 1603 - WinCert
Java Error Code 1603: Causes and How to Resolve Them
How to fix Java error “class interface or enum expected”
How to Fix Java Virtual Machine Launcher Error On Windows
Solución: Error al no encontrar Java Runtime Environment en Windows ...
Getting Error While Invoking Java code into Uipath - Studio - UiPath ...
Java Install Did Not Complete Error Code 1603
Windows Error 5 Java Vm at Ronald Rodriquez blog
Could not create the java virtual machine error - Sujeto
How to Fix "Unable to Locate Java Runtime" Error - Guiding Tech
Solución error código 1603: actualización de Java no finalizada - Mundowin
Types of Error in Java - Naukri Code 360
How to Fix Could Not Create The Java Virtual Machine Error - Coding Lap
Error 401 on integrating Github Actions with Fortify - Core Application ...
Java Error By One Off
Minecraft Java startar ej. Java error och Bluescreen - Spel ...
How to Fix “Could Not Create The Java Virtual Machine” Error - Tech ...
Error when installing Fortify Extension for Visual Studio 2019
Fortify SSC - Exception: An unexpected error occurred during scan ...
Fortify extension in Visual Studio 2019 error - Fortify Discussions ...
Java Error | Types of Errors in Java | 100% Free Java Tutorials
Throws Error In Java at Daniel Gilmore blog
Solved Why am I getting this error for my java code on lines | Chegg.com
Fortify WebInspect error when creating a new database for WebInspect ...
Fortify SCA 24.2 : Failed to detect “Poor Error Handling : Overly Broad ...
Top 6 Ways to Fix Exit Code 1 Crash Error on Minecraft Java Edition
Fortify Java Security Assistant Overview | PDF | Eclipse (Software ...
Java version error mismatch - Java Edition Support - Support ...
Java Error | PDF
Fortify XML import error: exception error occurred during the report ...
Fortify MS Visual Studio 2017 error "Failed to load VCProjectWrapper ...
[IntelliJ] Fortify Plugin 연동 시 오류 해결방법 - Plugin 'com.hp.fortify ...
Fortify 安装与使用_fortify使用-CSDN博客
SCCM Task Sequence Error Code 0x80091007 [Fix]
How To Fix Java Exception Has Occurred - Full Guide - YouTube
How to Fix Error Occurred During Initialization of VM Java/Lang ...
Please help! Error in fortify() : r/ecology
Oracle's Java Hates Least-Privilege | BeyondTrust
Could Not Find Or Load Main Class Error in Java: Solutions
How to Fix JAVA Error: Release Version Not Supported – cicdTrail Technology
Troubleshoot Exception Errors In A Netconf Java Application – NZCA
HP Fortify will not create 'batch' file - Stack Overflow
Its all about Java: Programming Errors in Java language
How to Fix ‘Java Install Did Not Complete – Error Code 1603’ on Windows ...
Errors in Java - UgtWorld
Very basic java errors | PDF
What is Fortify and use cases of Fortify?
50 Common Java Errors and How to Avoid Them- Stackify
How to fix all java errors
已解决!!Fortify工具打开时报错:An error has occurred*_fortify 打开报错-CSDN博客
第37篇:fortify代码审计工具的使用技巧(1)-审计java代码过程_fortify java 编译-CSDN博客
How To Fix Java Errors - Tomorrowdisaster33
你以為沒事?OpenText™ Fortify SAST 告訴你程式碼裡的真相
Scala Security: Eliminate 200+ Code-Level Threats With Fortify SCA For ...
#34 Understanding Errors and Exceptions in Java using Eclipse - YouTube
Java Errors & Software Development Process
Ошибка «A java exception has occurred»: что делать
Fortify Remediation Plugin issue | Eclipse - Core Application Security ...
Trying to install Fortify. Getting an error when trying to publish ...
10 Best Java Code Review Tools for Developers [Updated June 2026] - Qodo
Debug messages in java
Fixing Common Java Errors A Beginner's Troubleshooting Guide | MoldStud
VerifyError using Java 7 & Eclipse Juno · Issue #543 · projectlombok ...
Fortify 实战:Java Web 应用代码审计与漏洞修复-守阙安全团队-渗透测试|APP安全|源代码审计
Results in Quick access Java Installation Not Completed Unable to ...
Java Exceptions: Handling Runtime Errors - CodeLucky
Q.3 StackOverflowError in Java Explained | Infinite Recursion Java ...
Java Errors - Java Community | Help. Code. Learn.
Java Error: Failed to validate certificate. The application will not be ...
Fortify Static Code Analyzer 1.0 Download (Free trial)
Access Control Weak Security Constraint Fortify at Jordan Biddle blog
Laravel 11 Errors with Fortify and Sanctum and how to handle them: CORs ...
Initialization, Types of Errors & Comments in Java (Explained with ...
Java 7 Troubleshooting (disabled support for MD2) « Windows Explored
Java script errors by karan chanana | DOCX
Java Application Development Vulnerabilities | PDF
Fortify DAST API Unable to create scan. Error: Invalid column name ...
第37篇:fortify代码审计工具的使用技巧(1)-审计java代码过程-腾讯云开发者社区-腾讯云
代码测试工具Fortify最新版本介绍及实操 - 知乎
다음 스위치에 오류가 있는 Java를 설치할 수 없음 수정 | Delft Stack
Minecraft Java-fout: codehandleiding en oplossingen
How to Fix Java: 8 Steps (with Pictures) - wikiHow Tech
code signing - "java.lang.SecurityException: cannot verify signature ...
How to Fix "Error 500: Java.Lang.NullPointerException"
第37篇:fortify代码审计工具的使用技巧(1)-审计java代码过程 | CN-SEC 中文网
Fortify替换jar包和规则文件Fortify如何检测Java代码-Fortify中文网站
Where to download Fortify_WebInspect_Runtime_Agent_Java_xx.x.tar.gz ...
Solved Java// please help me fix the errors. As well as | Chegg.com
Solved [JAVA] Can anyone help me in fixing this error? I | Chegg.com
安全测试工具Fortify最新版本及使用操作演示-CSDN博客
【安全测试-fortify源码扫描】linux下的fortify源码扫描 - 码上起舞 - 博客园
JAVA静态代码审计神器:Fortify_java代码审计报告工具-CSDN博客
Solved Exercise26_07.java:8: error: cannot find symbol class | Chegg.com
Add support for '3bff1800ff8131fe55006b02090200011101434e531131808e ...
Process is terminated due to StackOverflowException. - Core Application ...